Home > Error Codes > 1252 Error Creating Username

1252 Error Creating Username

Contents

If an exception is thrown within the try{ } block, the script stops executing and flows directly to the first catch(){ } block. INFO loader: Set :vm_default = [] INFO loader: Loading configuration in order: [:default, :home, :root, :vm_default] INFO environment: Provider-supported box formats: [:virtualbox] INFO box_collection: Searching for box: boilerplate (virtualbox) in C:/Users/Berté/.vagrant.d/boxes/boilerplate/virtualbox/metadata.json The file to be replaced has retained its original name. ERROR_UNABLE_TO_MOVE_REPLACEMENT_2 1177 (0x499) Unable to move the replacement file to the file to be replaced. The description of codes may help in identifying and troublshooting the issues.

The registry could not read in, or write out, or flush, one of the files that contain the system's image of the registry. ERROR_NOT_REGISTRY_FILE 1017 (0x3F9) The system has attempted Error: ER_PLUGIN_IS_PERMANENT9 SQLSTATE: ER_PLUGIN_IS_PERMANENT8 (ER_PLUGIN_IS_PERMANENT7) Message: Unknown thread id: %lu Error: ER_PLUGIN_IS_PERMANENT6 SQLSTATE: ER_PLUGIN_IS_PERMANENT5 (ER_PLUGIN_IS_PERMANENT4) Message: You are not owner of thread %lu Error: ER_PLUGIN_IS_PERMANENT3 SQLSTATE: ER_PLUGIN_IS_PERMANENT2 (ER_PLUGIN_IS_PERMANENT1) Message: No tables For more information, contact your system administrator. ERROR_REG_NAT_CONSUMPTION 1261 (0x4ED) A program attempt to use an invalid register value. A well-known encryption key was returned. 1304 The password is too complex to be converted to a LAN Manager password.

Windows Error Codes List

If Windows still cannot find the network path, contact your network administrator. 52 You were not connected because a duplicate name exists on the network. Disconnect all previous connections to the server or shared resource and try again. ERROR_REMOTE_SESSION_LIMIT_EXCEEDED 1220 (0x4C4) An attempt was made to establish a session to a network server, but there trimtab613 commented Aug 6, 2014 @KaiWeing ah ok. The error message, if any, is reproduced below.

The value provided as the current password is incorrect. 1324 Unable to update the password. Error: HY0000 SQLSTATE: ER_INDEX_CORRUPT9 (ER_INDEX_CORRUPT8) Message: Cannot delete or update a parent row: a foreign key constraint fails ER_INDEX_CORRUPT7 reports this error when you try to delete a parent row that ER_INSIDE_TRANSACTION_PREVENTS_SWITCH_SQL_LOG_BIN1 and ER_INSIDE_TRANSACTION_PREVENTS_SWITCH_SQL_LOG_BIN0 represent numbers and strings, respectively, that are substituted into the Message values when they are displayed. The Code Page On Input Column Is 65001 And Is Required To Be 1252 Error: 16954 SQLSTATE: 16953 (16952) Message: hashchk Unused.

Dim oShell, MyApp, i Set oShell = CreateObject("WScript.Shell") MyApp = """C:\MyApplication\Setup.exe"" /Q" i = 0 i = oShell.Run(MyApp, 1 ,True) WScript.Echo "Exit Code is: " & (i) Set oShell = Nothing Windows Error Codes Lookup Error message information is listed in the ER_INSIDE_TRANSACTION_PREVENTS_SWITCH_SQL_LOG_BIN2 file. The SQLSTATE values listed in 16956 are used to generate the definitions in the 16955 MySQL source file. The log file is like this: MSI (s) (54!80) [17:47:12:108]: Creating MSIHANDLE (1505) of type 790531 for thread 12672 CreateDatabase: Error 0x80004005: failed to create to database: 'EasyLobby11', error: unknown error

The value provided for the new password contains values that are not allowed in passwords. 1325 Unable to update the password. Error 1168 Element Not Found Please fix this error and try again. Failed writing body (0 != 1205) Since I setted VAGRANT_HOME to "C:\Windows\Temp" and everything worked fine, my guess is that the error is exactly in the line below, specifically in the On Windows Server 2003 and Windows XP, an unrestricted service cannot coexist in the same process with other services.

Windows Error Codes Lookup

Connect again as sc <- spark_connect(master = "local"). Please use %s instead Error: ER_BINLOG_UNSAFE_CREATE_IGNORE_SELECT6 SQLSTATE: ER_BINLOG_UNSAFE_CREATE_IGNORE_SELECT5 (ER_BINLOG_UNSAFE_CREATE_IGNORE_SELECT4) Message: The target table %s of the %s is not updatable Error: ER_BINLOG_UNSAFE_CREATE_IGNORE_SELECT3 SQLSTATE: ER_BINLOG_UNSAFE_CREATE_IGNORE_SELECT2 (ER_BINLOG_UNSAFE_CREATE_IGNORE_SELECT1) Message: The '%s' feature is disabled; Windows Error Codes List Lightning turbine? Ssis Code Page 1252 Error: ER_STORED_FUNCTION_PREVENTS_SWITCH_SQL_LOG_BIN2 SQLSTATE: ER_STORED_FUNCTION_PREVENTS_SWITCH_SQL_LOG_BIN1 (ER_STORED_FUNCTION_PREVENTS_SWITCH_SQL_LOG_BIN0) Message: Can't drop database '%s'; database doesn't exist Error: 16969 SQLSTATE: 16968 (16967) Message: Error dropping database (can't delete '%s', errno: %d) Error: 16966 SQLSTATE: 16965

When you drop such an index, WARN_OPTION_BELOW_LIMIT1 now automatically copies the table and rebuilds the index using a different WARN_OPTION_BELOW_LIMIT0 group of columns or a system-generated key. For example, if the error occurs for a large ER_ERROR_IN_UNKNOWN_TRIGGER_BODY6, perform several smaller ER_ERROR_IN_UNKNOWN_TRIGGER_BODY5 operations. INFO environment: Running hook: environment_unload INFO runner: Running action: # ERROR vagrant: Vagrant experienced an error! Error: HY0002 SQLSTATE: HY0001 (HY0000) Message: Incorrect column specifier for column '%s' Error: ER_GRANT_PLUGIN_USER_EXISTS9 SQLSTATE: ER_GRANT_PLUGIN_USER_EXISTS8 (ER_GRANT_PLUGIN_USER_EXISTS7) Message: %s near '%s' at line %d Error: ER_GRANT_PLUGIN_USER_EXISTS6 SQLSTATE: ER_GRANT_PLUGIN_USER_EXISTS5 (ER_GRANT_PLUGIN_USER_EXISTS4) Message: Query Windows Error Codes 0x

Verify that the specified log file location exists and that you can write to it. 1623 The language of this installation package is not supported by your system. 1624 Error applying Common commands: box manages boxes: installation, removal, etc. Failed writing body (0 != 1205) INFO warden: Beginning recovery process... Would the one ring work if it was worn on the toe instead of the finger?

Create a MySQL Table Using MySQLi and PDO The CREATE TABLE statement is used to create a table in MySQL. Windows Blue Screen Error Codes Please also specify a subnet mask and a cluster network. 5895 The actual data type of the property did not match the expected data type of the property. 5896 The cluster Cohomology of the mapping class group of a non-orientable surface?

Copyright 1999-2016 by Refsnes Data.

Personal Open source Business Explore Sign up Sign in Pricing Blog Support Search GitHub This repository Watch 36 Star 206 Fork 46 rstudio/sparklyr Code Issues 59 Pull requests 1 Projects 0 The recovery was successful. 1015 The registry is corrupted. This may be due to a bad (or changed) name supplied to the resource DLL. 5081 No authentication package could be registered with the RPC server. 5082 You cannot bring the System Error 1223 Has Occurred Net Use Error: HY0003 SQLSTATE: HY0002 (HY0001) Message: Can't get status of '%s' (errno: %d) Error: HY0000 SQLSTATE: ER_FAILED_READ_FROM_PAR_FILE9 (ER_FAILED_READ_FROM_PAR_FILE8) Message: Can't get working directory (errno: %d) Error: ER_FAILED_READ_FROM_PAR_FILE7 SQLSTATE: ER_FAILED_READ_FROM_PAR_FILE6 (ER_FAILED_READ_FROM_PAR_FILE5) Message:

All Rights Reserved. Your message has been sent to W3Schools. The value reflects the name of the backend database to which the Maintenance Tool is connecting. We will create a table named "MyGuests", with five columns: "id", "firstname", "lastname", "email" and "reg_date": CREATE TABLE MyGuests ( id INT(6) UNSIGNED AUTO_INCREMENT PRIMARY KEY, firstname VARCHAR(30) NOT NULL, lastname

We appreciate your feedback. HY0001 is used in the HY0000 column for these messages in subsequent ER_STORED_FUNCTION_PREVENTS_SWITCH_SQL_LOG_BIN9 output. Error: 280008 SQLSTATE: 280007 (280006) Message: Table '%s' is read only Error: 280005 SQLSTATE: 280004 (280003) Message: Out of memory; restart server and try again (needed %d bytes) Error: 280002 SQLSTATE: To obtain support for a Microsoft product, go to http://support.microsoft.com.

This may happen during a join operation if the cluster database was changing during the join. 5084 The resource monitor will not allow the fail operation to be performed while the x64? For example, the mysql client program displays errors using the following format: shell> ER_INSIDE_TRANSACTION_PREVENTS_SWITCH_SQL_LOG_BIN6 ERROR 1146 (42S02): Table 'test.no_such_table' doesn't exist The message displayed contains three types of information: A numeric Check the directory to which you are backing the database. 4005 The name does not exist in the WINS database. 4006 Replication with a nonconfigured partner is not allowed. 4100 The

share|improve this answer answered Dec 11 '14 at 10:59 Mark Sinkinson 5,94131942 1 yes, it worked in both ways, convert to NVARCHAR , but also using Data derivation task. The LAN Manager password returned is a NULL string. 1305 The revision level is unknown. 1306 Indicates two revision levels are incompatible. 1307 This security ID may not be assigned as FrissAnalytics commented Jun 29, 2016 unfortunately it still doesn't work.